Nieuws:

Welkom, Gast. Alsjeblieft inloggen of registreren.
Heb je de activerings-mail niet ontvangen?

Auteur Topic: Ubuntu + highpoint rocketraid 2320 driver failure ?  (gelezen 726 keer)

MouSSen

  • Gast
Ubuntu + highpoint rocketraid 2320 driver failure ?
« Gepost op: 2007/04/15, 12:36:52 »
Naar aanleiding van de misserie met de raid's in mijn win xp box en de 2tb limieten heb ik besloten om te switchen van os :). ( Highpoint rocketraid 2320 + gigabyte GA965P-DQ6 )

Ik heb gekozen voor ubuntu, aangezien ik daar een klein beetje ervaring mee had.

De pc waarop ik ubuntu Edgy installeerde met een kernel 2.6 bestaat uit een Intel Celeron D 3.0 Ghz + 1Gb ram + asus P5GZ-MX met een 40 Gb bootschijfje.

Na installeren van ubuntu en de nodig updates wou ik de driver compilen voor de rocketraid controller. Deze haalde ik van de site bij de fabrikant ( http://www.highpoint-tech.com/USA/bios_rr2320.htm ) En daar loopt het nu al mis :)

heb dan wat gegoogeld en blijkbaar was er nog iemand die problemen had met het compilen van die driver ( http://ubuntuforums.org/showthread.php?t=311723 ). Ik heb zijn 'mini-howto' gevolgd, maar bij de laatste stap ben ik niet in staat van de driver te compilen / installeren.

Ik krijg volgende error:

make[1]: Entering directory `/usr/src/linux-headers-2.6.15-28-686'
CC [M] /root/rocketraid/rr232x-linux-src-1.05/osm/linux/os_linux.o
In file included from include/asm/mpspec.h:5,
from include/asm/smp.h:18,
from include/linux/smp.h:19,
from include/linux/sched.h:26,
from include/linux/module.h:10,
from /root/rocketraid/rr232x-linux-src-1.05/osm/linux/osm_linux.h:21,
from /root/rocketraid/rr232x-linux-src-1.05/osm/linux/os_linux.c:6:
include/asm/mpspec_def.h:78: warning: ���packed��� attribute ignored for field of type ���unsigned char[6]���
/root/rocketraid/rr232x-linux-src-1.05/osm/linux/os_linux.c: In function ���refresh_sd_flags���:
/root/rocketraid/rr232x-linux-src-1.05/osm/linux/os_linux.c:261: warning: implicit declaration of function ���mutex_lock���
/root/rocketraid/rr232x-linux-src-1.05/osm/linux/os_linux.c:261: error: ���struct inode��� has no member named ���i_mutex���
/root/rocketraid/rr232x-linux-src-1.05/osm/linux/os_linux.c:267: warning: implicit declaration of function ���mutex_unlock���/root/rocketraid/rr232x-linux-src-1.05/osm/linux/os_linux.c:267: error: ���struct inode��� has no member named ���i_mutex���
make[2]: *** [/root/rocketraid/rr232x-linux-src-1.05/osm/linux/os_linux.o] Error 1
make[1]: *** [_module_/root/rocketraid/rr232x-linux-src-1.05/product/rr232x/linux/.build] Error 2
make[1]: Leaving directory `/usr/src/linux-headers-2.6.15-28-686'
make: *** [rr232x.ko] Error 2

Iemand enig id wat ik verkeerd doe |:(

MouSSen

  • Gast
Ubuntu + highpoint rocketraid 2320 driver failure ?
« Reactie #1 Gepost op: 2007/04/16, 12:32:28 »
ik heb ubuntu 6.10 geinstalleerd met kernel 2.6.17.15 ( dacht ik )

en daarop kon ik de driver feilloos installeren mits één WARNING message:

root@HiRo:/usr/src/rocketraid/rr232x-linux-src-1.05/product/rr232x/linux# make install
make[1]: Entering directory `/usr/src/linux-headers-2.6.17-10-generic'
  CC [M]  /usr/src/rocketraid/rr232x-linux-src-1.05/osm/linux/os_linux.o
  CC [M]  /usr/src/rocketraid/rr232x-linux-src-1.05/osm/linux/osm_linux.o
  CC [M]  /usr/src/rocketraid/rr232x-linux-src-1.05/osm/linux/div64.o
  CC [M]  /usr/src/rocketraid/rr232x-linux-src-1.05/osm/linux/hptinfo.o
  CC [M]  /usr/src/rocketraid/rr232x-linux-src-1.05/product/rr232x/linux/config.o
  LD [M]  /usr/src/rocketraid/rr232x-linux-src-1.05/product/rr232x/linux/.build/rr232x.o
  Building modules, stage 2.
  MODPOST
WARNING: could not find /usr/src/rocketraid/rr232x- linux-src-1.05/product/rr232x/linux/.build/.os_linux.o.cmd for /usr/src/rocketraid/rr232x-linux-src-1.05/product/rr232x/linux/.build/os_linux.o
  CC      /usr/src/rocketraid/rr232x-linux-src-1.05/product/rr232x/linux/.build/rr232x.mod.o
  LD [M]  /usr/src/rocketraid/rr232x-linux-src-1.05/product/rr232x/linux/.build/rr232x.ko
make[1]: Leaving directory `/usr/src/linux-headers-2.6.17-10-generic'
You made a module which is for current kernel 2.6.17-10-generic .
Deleting previous installed driver module rr232x...
Install the new driver module...
Updating module dependencies...Done.
Checking for initrd images to be updated...
backup /boot/initrd.img-2.6.17-10-generic to /boot/initrd.img-2.6.17-10-generic.rr232x