Nieuws:

Welkom, Gast. Alsjeblieft inloggen of registreren.
Heb je de activerings-mail niet ontvangen?

Auteur Topic: Madwifi install error  (gelezen 646 keer)

Roenie

  • Gast
Madwifi install error
« Gepost op: 2007/01/21, 12:23:11 »
Hoi, ik heb een probleem met het installen van Madwifi-ng. Ik ben best wel een linux-newbie dus daarom vraag ik het hier even. :)
Ik volg de stappen zoals ze hier:  http://www.aircrack-ng.org/doku.php?id=madwifi-ng  beschreven staan. De problemen beginnen als ik het make command uitvoer. Ik krijg dan dit te zien:

jeroen@laptop-jt:~/madwifi-ng$ make
Checking requirements... ok.
Checking kernel configuration... ok.
make -C /lib/modules/2.6.17-10-generic/build SUBDIRS=/home/jeroen/madwifi-ng modules
make[1]: Entering directory `/usr/src/linux-headers-2.6.17-10-generic'
  CC [M]  /home/jeroen/madwifi-ng/ath/if_ath_pci.o
  LD [M]  /home/jeroen/madwifi-ng/ath/ath_pci.o
  HOSTCC  /home/jeroen/madwifi-ng/ath_hal/uudecode
/home/jeroen/madwifi-ng/ath_hal/uudecode.c:26:19: error: stdio.h: No such file or directory
/home/jeroen/madwifi-ng/ath_hal/uudecode.c:27:19: error: errno.h: No such file or directory
/home/jeroen/madwifi-ng/ath_hal/uudecode.c:28:20: error: getopt.h: No such file or directory
/home/jeroen/madwifi-ng/ath_hal/uudecode.c:29:20: error: string.h: No such file or directory
/home/jeroen/madwifi-ng/ath_hal/uudecode.c:30:20: error: stdlib.h: No such file or directory
/home/jeroen/madwifi-ng/ath_hal/uudecode.c:32:23: error: sys/fcntl.h: No such file or directory
/home/jeroen/madwifi-ng/ath_hal/uudecode.c:33:22: error: sys/stat.h: No such file or directory
/home/jeroen/madwifi-ng/ath_hal/uudecode.c: In function 'uudecode_usage':
/home/jeroen/madwifi-ng/ath_hal/uudecode.c:37: warning: implicit declaration of function 'printf'
/home/jeroen/madwifi-ng/ath_hal/uudecode.c:37: warning: incompatible implicit declaration of built-in function 'printf'
/home/jeroen/madwifi-ng/ath_hal/uudecode.c: At top level:
/home/jeroen/madwifi-ng/ath_hal/uudecode.c:40: error: expected ')' before '*' token
/home/jeroen/madwifi-ng/ath_hal/uudecode.c:70: error: expected ')' before '*' token
/home/jeroen/madwifi-ng/ath_hal/uudecode.c: In function 'main':
/home/jeroen/madwifi-ng/ath_hal/uudecode.c:121: error: 'FILE' undeclared (first use in this function)
/home/jeroen/madwifi-ng/ath_hal/uudecode.c:121: error: (Each undeclared identifier is reported only once
/home/jeroen/madwifi-ng/ath_hal/uudecode.c:121: error: for each function it appears in.)
/home/jeroen/madwifi-ng/ath_hal/uudecode.c:121: error: 'src_stream' undeclared (first use in this function)
/home/jeroen/madwifi-ng/ath_hal/uudecode.c:122: error: 'dst_stream' undeclared (first use in this function)
/home/jeroen/madwifi-ng/ath_hal/uudecode.c:122: error: 'NULL' undeclared (first use in this function)
/home/jeroen/madwifi-ng/ath_hal/uudecode.c:130: warning: implicit declaration of function 'getopt'
/home/jeroen/madwifi-ng/ath_hal/uudecode.c:134: error: 'optarg' undeclared (first use in this function)
/home/jeroen/madwifi-ng/ath_hal/uudecode.c:138: warning: implicit declaration of function 'exit'
/home/jeroen/madwifi-ng/ath_hal/uudecode.c:138: warning: incompatible implicit declaration of built-in function 'exit'
/home/jeroen/madwifi-ng/ath_hal/uudecode.c:141: error: 'optind' undeclared (first use in this function)
/home/jeroen/madwifi-ng/ath_hal/uudecode.c:142: error: 'stdin' undeclared (first use in this function)
/home/jeroen/madwifi-ng/ath_hal/uudecode.c:144: warning: implicit declaration of function 'fopen'
/home/jeroen/madwifi-ng/ath_hal/uudecode.c:146: warning: implicit declaration of function 'fprintf'
/home/jeroen/madwifi-ng/ath_hal/uudecode.c:146: warning: incompatible implicit declaration of built-in function 'fprintf'
/home/jeroen/madwifi-ng/ath_hal/uudecode.c:146: error: 'stderr' undeclared (first use in this function)
/home/jeroen/madwifi-ng/ath_hal/uudecode.c:147: warning: implicit declaration of function 'strerror'
/home/jeroen/madwifi-ng/ath_hal/uudecode.c:147: error: 'errno' undeclared (first use in this function)
/home/jeroen/madwifi-ng/ath_hal/uudecode.c:147: warning: format '%s' expects type 'char *', but argument 4 has type 'int'
/home/jeroen/madwifi-ng/ath_hal/uudecode.c:148: warning: incompatible implicit declaration of built-in function 'exit'
/home/jeroen/madwifi-ng/ath_hal/uudecode.c:152: warning: incompatible implicit declaration of built-in function 'exit'
/home/jeroen/madwifi-ng/ath_hal/uudecode.c:156: warning: implicit declaration of function 'get_line_from_file'
/home/jeroen/madwifi-ng/ath_hal/uudecode.c:156: warning: assignment makes pointer from integer without a cast
/home/jeroen/madwifi-ng/ath_hal/uudecode.c:157: warning: implicit declaration of function 'strncmp'
/home/jeroen/madwifi-ng/ath_hal/uudecode.c:164: warning: incompatible implicit declaration of built-in function 'fprintf'
/home/jeroen/madwifi-ng/ath_hal/uudecode.c:165: warning: incompatible implicit declaration of built-in function 'exit'
/home/jeroen/madwifi-ng/ath_hal/uudecode.c:168: warning: implicit declaration of function 'strtoul'
/home/jeroen/madwifi-ng/ath_hal/uudecode.c:170: warning: implicit declaration of function 'strchr'
/home/jeroen/madwifi-ng/ath_hal/uudecode.c:170: warning: incompatible implicit declaration of built-in function 'strchr'
/home/jeroen/madwifi-ng/ath_hal/uudecode.c:172: warning: incompatible implicit declaration of built-in function 'fprintf'
/home/jeroen/madwifi-ng/ath_hal/uudecode.c:173: warning: incompatible implicit declaration of built-in function 'exit'
/home/jeroen/madwifi-ng/ath_hal/uudecode.c:178: warning: implicit declaration of function 'strcmp'
/home/jeroen/madwifi-ng/ath_hal/uudecode.c:179: error: 'stdout' undeclared (first use in this function)
/home/jeroen/madwifi-ng/ath_hal/uudecode.c:182: error: 'O_WRONLY' undeclared (first use in this function)
/home/jeroen/madwifi-ng/ath_hal/uudecode.c:182: error: 'O_CREAT' undeclared (first use in this function)
/home/jeroen/madwifi-ng/ath_hal/uudecode.c:182: error: 'O_TRUNC' undeclared (first use in this function)
/home/jeroen/madwifi-ng/ath_hal/uudecode.c:186: error: 'O_EXCL' undeclared (first use in this function)
/home/jeroen/madwifi-ng/ath_hal/uudecode.c:188: warning: implicit declaration of function 'open'
/home/jeroen/madwifi-ng/ath_hal/uudecode.c:189: error: 'S_IRWXU' undeclared (first use in this function)
/home/jeroen/madwifi-ng/ath_hal/uudecode.c:189: error: 'S_IRWXG' undeclared (first use in this function)
/home/jeroen/madwifi-ng/ath_hal/uudecode.c:189: error: 'S_IRWXO' undeclared (first use in this function)
/home/jeroen/madwifi-ng/ath_hal/uudecode.c:191: warning: implicit declaration of function 'fdopen'
/home/jeroen/madwifi-ng/ath_hal/uudecode.c:193: warning: incompatible implicit declaration of built-in function 'fprintf'
/home/jeroen/madwifi-ng/ath_hal/uudecode.c:194: warning: format '%s' expects type 'char *', but argument 4 has type 'int'
/home/jeroen/madwifi-ng/ath_hal/uudecode.c:195: warning: incompatible implicit declaration of built-in function 'exit'
/home/jeroen/madwifi-ng/ath_hal/uudecode.c:199: warning: implicit declaration of function 'read_stduu'
/home/jeroen/madwifi-ng/ath_hal/uudecode.c:201: warning: implicit declaration of function 'fclose'
make[3]: *** [/home/jeroen/madwifi-ng/ath_hal/uudecode] Error 1
make[2]: *** [/home/jeroen/madwifi-ng/ath_hal] Error 2
make[1]: *** [_module_/home/jeroen/madwifi-ng] Error 2
make[1]: Leaving directory `/usr/src/linux-headers-2.6.17-10-generic'
make: *** [modules] Error 2
Bij make install krijg ik ook een error maar ik denk dat dit voortvloeit uit de bovenstaande error. Ik heb Ubuntu 6.10 en ik draai deze op een t60 laptop. Ik heb 2 wlankaarten: de ingebouwde centrino en een atheros W5005G.

Edit: De error krijg ik ook in root, dus daar ligt het niet aan.

Roenie

  • Gast
Madwifi install error
« Reactie #1 Gepost op: 2007/01/21, 14:05:14 »
Ik heb nu ook geprobeer Madwifi ipv Madwifi-ng te installeren. Ook hier gaat het fout:

Beschrijving staat hier: http://www.aircrack-ng.org/doku.php?id=madwifi

Foutmelding

root@laptop-jt:/home/jeroen/madwifi-old# make KERNELPATH=/usr/src/linux-headers-2.6.17-10
Checking if all requirements are met... FAILED
Please enable wireless extensions.
make: *** [configcheck] Error 1
Hoe kan ik deze wireless extensions enablen?