Nieuws:

We zijn er weer.

Na lange tijd van afwezigheid zijn we er weer  :laugh:
We hebben alle wachtwoorden gereset, je oude wachtwoord werkt niet meer.Je moet via het "wachtwoord vergeten"-linkje je wachtwoord resetten. Je krijgt hiervoor een mailtje op het adres dat je bij ons geregistreerd hebt.

De komende tijd zijn we nog druk bezig om de rest van de site op te bouwen, dus het kan zijn dat sommige onderdelen (tijdelijk) niet werken.

Welkom, Gast. Alsjeblieft inloggen of registreren.
Heb je de activerings-mail niet ontvangen?

Auteur Topic: Ubuntu 7.10 wireless Atheros netwerkkaart  (gelezen 11771 keer)

Laurensz

  • Gast
Ubuntu 7.10 wireless Atheros netwerkkaart
« Gepost op: 2008/05/18, 13:06:40 »
Hoi allemaal, ik heb sinds kort Ubuntu 8.04 geinstalleerd en wil nu gebruik maken van het internet. Ik heb een draadloze netwerkkaart van Atheros. Ik heb al veel op het forum rondgekeken, en heb de synaptics builder of zoiets dergelijks al geinstalleerd, inclusief madwifi-ng-r2756+ar5007.tar.

Wanneer ik eenmaal klik op het netwerkicoontje staat er "Wired network, en Manual configuration". Als ik op manual configuration klik staat er alleen maar "wired connection: roaming mode enabled", en "modem connection: this network interface is not configured".

In de terminal is dit de output van "lspci"

00:00.0 RAM memory: nVidia Corporation C51 Host Bridge (rev a2)
00:00.1 RAM memory: nVidia Corporation C51 Memory Controller 0 (rev a2)
00:00.2 RAM memory: nVidia Corporation C51 Memory Controller 1 (rev a2)
00:00.3 RAM memory: nVidia Corporation C51 Memory Controller 5 (rev a2)
00:00.4 RAM memory: nVidia Corporation C51 Memory Controller 4 (rev a2)
00:00.5 RAM memory: nVidia Corporation C51 Host Bridge (rev a2)
00:00.6 RAM memory: nVidia Corporation C51 Memory Controller 3 (rev a2)
00:00.7 RAM memory: nVidia Corporation C51 Memory Controller 2 (rev a2)
00:02.0 PCI bridge: nVidia Corporation C51 PCI Express Bridge (rev a1)
00:04.0 PCI bridge: nVidia Corporation C51 PCI Express Bridge (rev a1)
00:09.0 RAM memory: nVidia Corporation MCP51 Host Bridge (rev a2)
00:0a.0 ISA bridge: nVidia Corporation MCP51 LPC Bridge (rev a3)
00:0a.1 SMBus: nVidia Corporation MCP51 SMBus (rev a3)
00:0a.2 RAM memory: nVidia Corporation MCP51 Memory Controller 0 (rev a3)
00:0b.0 USB Controller: nVidia Corporation MCP51 USB Controller (rev a3)
00:0b.1 USB Controller: nVidia Corporation MCP51 USB Controller (rev a3)
00:0d.0 IDE interface: nVidia Corporation MCP51 IDE (rev a1)
00:0e.0 IDE interface: nVidia Corporation MCP51 Serial ATA Controller (rev a1)
00:0f.0 IDE interface: nVidia Corporation MCP51 Serial ATA Controller (rev a1)
00:10.0 PCI bridge: nVidia Corporation MCP51 PCI Bridge (rev a2)
00:10.1 Audio device: nVidia Corporation MCP51 High Definition Audio (rev a2)
00:14.0 Bridge: nVidia Corporation MCP51 Ethernet Controller (rev a3)
00:18.0 Host bridge: Advanced Micro Devices [AMD] K8 [Athlon64/Opteron] HyperTransport Technology Configuration
00:18.1 Host bridge: Advanced Micro Devices [AMD] K8 [Athlon64/Opteron] Address Map
00:18.2 Host bridge: Advanced Micro Devices [AMD] K8 [Athlon64/Opteron] DRAM Controller
00:18.3 Host bridge: Advanced Micro Devices [AMD] K8 [Athlon64/Opteron] Miscellaneous Control
02:00.0 VGA compatible controller: nVidia Corporation G72 [GeForce 7500 LE] (rev a1)
03:05.0 FireWire (IEEE 1394): Agere Systems FW323 (rev 70)
03:09.0 Ethernet controller: Atheros Communications, Inc. AR5413 802.11abg NIC (rev 01)
03:0a.0 Multimedia controller: Philips Semiconductors SAA7133/SAA7135 Video Broadcast Decoder (rev d1)


lsusb:

Bus 002 Device 005: ID 046d:c517 Logitech, Inc.
Bus 002 Device 002: ID 0409:005a NEC Corp.
Bus 002 Device 004: ID 058f:6362 Alcor Micro Corp.
Bus 002 Device 003: ID 0781:5406 SanDisk Corp.
Bus 002 Device 001: ID 0000:0000  
Bus 001 Device 001: ID 0000:0000  


sudo iwconfig:

lo        no wireless extensions.

eth0      no wireless extensions.

Bedankt!

Offline Teun

  • Lid
  • Steunpunt: Nee
Ubuntu 7.10 wireless Atheros netwerkkaart
« Reactie #1 Gepost op: 2008/05/18, 16:09:51 »
Hier ben ik ook mee bezig. ik heb ook een Atheros pci kaartje. Welk merk staat er op de verpakking van jouw wifi kaartje? Ik heb icidu. Gek dat atheros helemaal nergen er opstaat.

Groeten van Teun
« Laatst bewerkt op: 2010/11/16, 14:02:44 door Teun »

Laurensz

  • Gast
Ubuntu 7.10 wireless Atheros netwerkkaart
« Reactie #2 Gepost op: 2008/05/18, 16:13:26 »
Op mijn windows dualboot zegt everest "HP 802.11b/g Wireless Network Adapter", het is namelijk een HP pc met een windows vista HP OEM versie..

Offline Pjotr

  • Lid
    • http://sites.google.com/site/computertip
  • Steunpunt: Nee
Ubuntu 7.10 wireless Atheros netwerkkaart
« Reactie #3 Gepost op: 2008/05/18, 16:20:13 »
Heb je deze handleiding al geprobeerd:
http://computertip.googlepages.com/atherosdraadlozekaart

Offline petervs

  • Lid
  • Steunpunt: Nee
Ubuntu 7.10 wireless Atheros netwerkkaart
« Reactie #4 Gepost op: 2008/05/18, 16:45:31 »
Citaat van: pjotr123
Heb je deze handleiding al geprobeerd:
http://computertip.googlepages.com/atherosdraadlozekaart
Ik vraag me af...Deze handleiding geldt voor de AR2425 (AR5007EG) chipset met pci id 168:001c, terwijl het hier gaat om de AR5413 met pci id 168c:001b, Zie:
http://pci-ids.ucw.cz/iii/?i=168c

Wie weet werkt het.Ik zal eens kijken wat er verder van bekend is.

edit: misschien 'n open deur, maar staan de drivers aangevinkt bij :
Systeem>Beheer> Beperkt ondersteunde Programma's ? (Standaard wel, maar je weet nooit)
Ubuntu MATE 16.04

Offline petervs

  • Lid
  • Steunpunt: Nee
Ubuntu 7.10 wireless Atheros netwerkkaart
« Reactie #5 Gepost op: 2008/05/18, 18:15:50 »
Er is 'n ticket over bij madwifi.org over het niet werken van AR5413 :
http://madwifi.org/ticket/1912

Je zou nog kunnen proberen om je kaart aan het werk te krijgen met ndiswrapper.
Ubuntu MATE 16.04

Laurensz

  • Gast
Ubuntu 7.10 wireless Atheros netwerkkaart
« Reactie #6 Gepost op: 2008/05/18, 18:44:51 »
Citaat van: Schiemanski
Citaat van: pjotr123
Heb je deze handleiding al geprobeerd:
http://computertip.googlepages.com/atherosdraadlozekaart
Ik vraag me af...Deze handleiding geldt voor de AR2425 (AR5007EG) chipset met pci id 168:001c, terwijl het hier gaat om de AR5413 met pci id 168c:001b, Zie:
http://pci-ids.ucw.cz/iii/?i=168c

Wie weet werkt het.Ik zal eens kijken wat er verder van bekend is.

edit: misschien 'n open deur, maar staan de drivers aangevinkt bij :
Systeem>Beheer> Beperkt ondersteunde Programma's ? (Standaard wel, maar je weet nooit)
Wat moet ik precies doen bij die url?

@Schiemanski: ik zal eventjes kijken..

Laurensz

  • Gast
Ubuntu 7.10 wireless Atheros netwerkkaart
« Reactie #7 Gepost op: 2008/05/18, 18:47:51 »
Ik heb trouwens 8.04 net geinstalleerd, misschien dat dat helpt..
Ook raar is dat ik op de live cd bij "synaptic package manager" wel gettext zag, maar nu hij is geinstalleerd alleen maar "gettext-base"? Gettext heb ik namelijk nodig voor bepaalde programma's..

Kan iemand me ook uitleggen hoe ndiswrapper werkt, want ik gebruikte eerst make distclean, en daarna make in de directory van de uitgepakte ndiswrapper, maar krijg op het einde heel veel errors:
laurens@laurens-ubuntu:~/ndiswrapper-1.52$ make
make -C driver
make[1]: Entering directory `/home/laurens/ndiswrapper-1.52/driver'
make -C /usr/src/linux-headers-2.6.24-16-generic SUBDIRS=/home/laurens/ndiswrapper-1.52/driver
make[2]: Entering directory `/usr/src/linux-headers-2.6.24-16-generic'
  LD      /home/laurens/ndiswrapper-1.52/driver/built-in.o
  CC [M]  /home/laurens/ndiswrapper-1.52/driver/crt.o
  CC [M]  /home/laurens/ndiswrapper-1.52/driver/hal.o
  CC [M]  /home/laurens/ndiswrapper-1.52/driver/iw_ndis.o
  CC [M]  /home/laurens/ndiswrapper-1.52/driver/loader.o
  CC [M]  /home/laurens/ndiswrapper-1.52/driver/ndis.o
  CC [M]  /home/laurens/ndiswrapper-1.52/driver/ntoskernel.o
  CC [M]  /home/laurens/ndiswrapper-1.52/driver/ntoskernel_io.o
  CC [M]  /home/laurens/ndiswrapper-1.52/driver/pe_linker.o
  CC [M]  /home/laurens/ndiswrapper-1.52/driver/pnp.o
  CC [M]  /home/laurens/ndiswrapper-1.52/driver/proc.o
  CC [M]  /home/laurens/ndiswrapper-1.52/driver/rtl.o
  CC [M]  /home/laurens/ndiswrapper-1.52/driver/wrapmem.o
  CC [M]  /home/laurens/ndiswrapper-1.52/driver/wrapndis.o
  CC [M]  /home/laurens/ndiswrapper-1.52/driver/wrapper.o
  CC [M]  /home/laurens/ndiswrapper-1.52/driver/usb.o
  CC [M]  /home/laurens/ndiswrapper-1.52/driver/divdi3.o
  LD [M]  /home/laurens/ndiswrapper-1.52/driver/ndiswrapper.o
  Building modules, stage 2.
  MODPOST 1 modules
  CC      /home/laurens/ndiswrapper-1.52/driver/ndiswrapper.mod.o
  LD [M]  /home/laurens/ndiswrapper-1.52/driver/ndiswrapper.ko
make[2]: Leaving directory `/usr/src/linux-headers-2.6.24-16-generic'
make[1]: Leaving directory `/home/laurens/ndiswrapper-1.52/driver'
make -C utils
make[1]: Entering directory `/home/laurens/ndiswrapper-1.52/utils'
gcc -g -Wall -I../driver -o loadndisdriver loadndisdriver.c
loadndisdriver.c:15:20: error: stdlib.h: No such file or directory
loadndisdriver.c:16:19: error: stdio.h: No such file or directory
loadndisdriver.c:17:19: error: errno.h: No such file or directory
loadndisdriver.c:18:20: error: string.h: No such file or directory
loadndisdriver.c:19:20: error: libgen.h: No such file or directory
loadndisdriver.c:21:22: error: sys/mman.h: No such file or directory
loadndisdriver.c:23:23: error: sys/types.h: No such file or directory
loadndisdriver.c:24:23: error: sys/ioctl.h: No such file or directory
loadndisdriver.c:25:22: error: sys/stat.h: No such file or directory
loadndisdriver.c:26:20: error: unistd.h: No such file or directory
loadndisdriver.c:27:19: error: fcntl.h: No such file or directory
In file included from /usr/lib/gcc/i486-linux-gnu/4.2.3/include/syslimits.h:7,
                 from /usr/lib/gcc/i486-linux-gnu/4.2.3/include/limits.h:11,
                 from loadndisdriver.c:28:
/usr/lib/gcc/i486-linux-gnu/4.2.3/include/limits.h:122:61: error: limits.h: No such file or directory
loadndisdriver.c:29:19: error: ctype.h: No such file or directory
loadndisdriver.c:30:20: error: dirent.h: No such file or directory
loadndisdriver.c:31:20: error: syslog.h: No such file or directory
loadndisdriver.c:34:25: error: linux/major.h: No such file or directory
loadndisdriver.c:35:25: error: linux/ioctl.h: No such file or directory
In file included from loadndisdriver.c:37:
../driver/loader.h:24: error: expected specifier-qualifier-list before ‘size_t’
loadndisdriver.c: In function ‘load_file’:
loadndisdriver.c:67: error: ‘size_t’ undeclared (first use in this function)
loadndisdriver.c:67: error: (Each undeclared identifier is reported only once
loadndisdriver.c:67: error: for each function it appears in.)
loadndisdriver.c:67: error: expected ‘;’ before ‘size’
loadndisdriver.c:68: error: ‘NULL’ undeclared (first use in this function)
loadndisdriver.c:69: error: storage size of ‘statbuf’ isn’t known
loadndisdriver.c:71: warning: implicit declaration of function ‘basename’
loadndisdriver.c:71: warning: initialization makes pointer from integer without a cast
loadndisdriver.c:73: warning: implicit declaration of function ‘open’
loadndisdriver.c:73: error: ‘O_RDONLY’ undeclared (first use in this function)
loadndisdriver.c:75: warning: implicit declaration of function ‘syslog’
loadndisdriver.c:75: error: ‘LOG_KERN’ undeclared (first use in this function)
loadndisdriver.c:75: error: ‘LOG_INFO’ undeclared (first use in this function)
loadndisdriver.c:75: warning: implicit declaration of function ‘strerror’
loadndisdriver.c:75: error: ‘errno’ undeclared (first use in this function)
loadndisdriver.c:76: error: ‘EINVAL’ undeclared (first use in this function)
loadndisdriver.c:79: warning: implicit declaration of function ‘fstat’
loadndisdriver.c:81: warning: implicit declaration of function ‘close’
loadndisdriver.c:84: error: ‘size’ undeclared (first use in this function)
loadndisdriver.c:86: warning: implicit declaration of function ‘mmap’
loadndisdriver.c:86: error: ‘PROT_READ’ undeclared (first use in this function)
loadndisdriver.c:86: error: ‘MAP_PRIVATE’ undeclared (first use in this function)
loadndisdriver.c:86: warning: assignment makes pointer from integer without a cast
loadndisdriver.c:87: error: ‘MAP_FAILED’ undeclared (first use in this function)
loadndisdriver.c:93: warning: implicit declaration of function ‘strncpy’
loadndisdriver.c:93: warning: incompatible implicit declaration of built-in function ‘strncpy’
loadndisdriver.c:95: error: ‘struct load_driver_file’ has no member named ‘size’
loadndisdriver.c:96: error: ‘struct load_driver_file’ has no member named ‘data’
loadndisdriver.c:69: warning: unused variable ‘statbuf’
loadndisdriver.c: In function ‘parse_setting_line’:
loadndisdriver.c:109: warning: implicit declaration of function ‘isspace’
loadndisdriver.c:115: warning: implicit declaration of function ‘strchr’
loadndisdriver.c:115: warning: incompatible implicit declaration of built-in function ‘strchr’
loadndisdriver.c:115: error: ‘NULL’ undeclared (first use in this function)
loadndisdriver.c:117: error: ‘LOG_KERN’ undeclared (first use in this function)
loadndisdriver.c:117: error: ‘LOG_INFO’ undeclared (first use in this function)
loadndisdriver.c:118: error: ‘EINVAL’ undeclared (first use in this function)
loadndisdriver.c:138: warning: implicit declaration of function ‘strlen’
loadndisdriver.c:138: warning: incompatible implicit declaration of built-in function ‘strlen’
loadndisdriver.c: In function ‘read_conf_file’:
loadndisdriver.c:150: error: storage size of ‘statbuf’ isn’t known
loadndisdriver.c:151: error: ‘FILE’ undeclared (first use in this function)
loadndisdriver.c:151: error: ‘config’ undeclared (first use in this function)
loadndisdriver.c:157: warning: implicit declaration of function ‘lstat’
loadndisdriver.c:158: error: ‘LOG_KERN’ undeclared (first use in this function)
loadndisdriver.c:158: error: ‘LOG_INFO’ undeclared (first use in this function)
loadndisdriver.c:158: error: ‘errno’ undeclared (first use in this function)
loadndisdriver.c:160: error: ‘EINVAL’ undeclared (first use in this function)
loadndisdriver.c:163: warning: implicit declaration of function ‘sscanf’
loadndisdriver.c:163: warning: incompatible implicit declaration of built-in function ‘sscanf’
loadndisdriver.c:178: warning: implicit declaration of function ‘fopen’
loadndisdriver.c:178: error: ‘NULL’ undeclared (first use in this function)
loadndisdriver.c:182: warning: implicit declaration of function ‘fgets’
loadndisdriver.c:194: warning: incompatible implicit declaration of built-in function ‘strncpy’
loadndisdriver.c:205: warning: implicit declaration of function ‘fclose’
loadndisdriver.c:150: warning: unused variable ‘statbuf’
loadndisdriver.c: In function ‘load_bin_file’:
loadndisdriver.c:217: error: ‘LOG_KERN’ undeclared (first use in this function)
loadndisdriver.c:217: error: ‘LOG_INFO’ undeclared (first use in this function)
loadndisdriver.c:219: warning: implicit declaration of function ‘tolower’
loadndisdriver.c:221: warning: implicit declaration of function ‘chdir’
loadndisdriver.c:222: error: ‘errno’ undeclared (first use in this function)
loadndisdriver.c:224: error: ‘EINVAL’ undeclared (first use in this function)
loadndisdriver.c:230: warning: incompatible implicit declaration of built-in function ‘strncpy’
loadndisdriver.c:232: warning: implicit declaration of function ‘ioctl’
loadndisdriver.c:232: warning: implicit declaration of function ‘_IOW’
loadndisdriver.c:232: error: expected expression before ‘struct’
loadndisdriver.c: In function ‘load_driver’:
loadndisdriver.c:249: error: ‘DIR’ undeclared (first use in this function)
loadndisdriver.c:249: error: ‘driver_dir’ undeclared (first use in this function)
loadndisdriver.c:251: error: ‘NULL’ undeclared (first use in this function)
loadndisdriver.c:255: error: ‘LOG_KERN’ undeclared (first use in this function)
loadndisdriver.c:255: error: ‘LOG_INFO’ undeclared (first use in this function)
loadndisdriver.c:257: error: ‘errno’ undeclared (first use in this function)
loadndisdriver.c:259: error: ‘EINVAL’ undeclared (first use in this function)
loadndisdriver.c:261: warning: implicit declaration of function ‘opendir’
loadndisdriver.c:267: warning: implicit declaration of function ‘malloc’
loadndisdriver.c:267: warning: incompatible implicit declaration of built-in function ‘malloc’
loadndisdriver.c:271: warning: implicit declaration of function ‘memset’
loadndisdriver.c:271: warning: incompatible implicit declaration of built-in function ‘memset’
loadndisdriver.c:272: warning: incompatible implicit declaration of built-in function ‘strncpy’
loadndisdriver.c:280: warning: implicit declaration of function ‘readdir’
loadndisdriver.c:280: warning: assignment makes pointer from integer without a cast
loadndisdriver.c:282: error: storage size of ‘statbuf’ isn’t known
loadndisdriver.c:284: error: dereferencing pointer to incomplete type
loadndisdriver.c:287: warning: implicit declaration of function ‘stat’
loadndisdriver.c:287: error: dereferencing pointer to incomplete type
loadndisdriver.c:288: warning: implicit declaration of function ‘S_ISREG’
loadndisdriver.c:289: error: dereferencing pointer to incomplete type
loadndisdriver.c:294: warning: incompatible implicit declaration of built-in function ‘strlen’
loadndisdriver.c:294: error: dereferencing pointer to incomplete type
loadndisdriver.c:296: warning: implicit declaration of function ‘strcasecmp’
loadndisdriver.c:296: error: dereferencing pointer to incomplete type
loadndisdriver.c:299: error: dereferencing pointer to incomplete type
loadndisdriver.c:302: error: dereferencing pointer to incomplete type
loadndisdriver.c:303: error: dereferencing pointer to incomplete type
loadndisdriver.c:305: error: dereferencing pointer to incomplete type
loadndisdriver.c:311: error: dereferencing pointer to incomplete type
loadndisdriver.c:312: error: dereferencing pointer to incomplete type
loadndisdriver.c:313: warning: implicit declaration of function ‘strcpy’
loadndisdriver.c:313: warning: incompatible implicit declaration of built-in function ‘strcpy’
loadndisdriver.c:314: error: dereferencing pointer to incomplete type
loadndisdriver.c:317: error: ‘struct load_driver_file’ has no member named ‘size’
loadndisdriver.c:318: error: ‘struct load_driver_file’ has no member named ‘data’
loadndisdriver.c:321: error: dereferencing pointer to incomplete type
loadndisdriver.c:282: warning: unused variable ‘statbuf’
loadndisdriver.c:344: error: expected expression before ‘struct’
loadndisdriver.c:346: warning: implicit declaration of function ‘closedir’
loadndisdriver.c:348: warning: implicit declaration of function ‘free’
loadndisdriver.c:355: warning: implicit declaration of function ‘munmap’
loadndisdriver.c:355: error: ‘struct load_driver_file’ has no member named ‘data’
loadndisdriver.c:355: error: ‘struct load_driver_file’ has no member named ‘size’
loadndisdriver.c:357: error: ‘struct load_driver_file’ has no member named ‘data’
loadndisdriver.c:357: error: ‘struct load_driver_file’ has no member named ‘size’
loadndisdriver.c: In function ‘get_device’:
loadndisdriver.c:367: error: storage size of ‘statbuf’ isn’t known
loadndisdriver.c:370: error: ‘LOG_KERN’ undeclared (first use in this function)
loadndisdriver.c:370: error: ‘LOG_INFO’ undeclared (first use in this function)
loadndisdriver.c:373: error: ‘errno’ undeclared (first use in this function)
loadndisdriver.c:374: error: ‘EINVAL’ undeclared (first use in this function)
loadndisdriver.c:376: warning: implicit declaration of function ‘snprintf’
loadndisdriver.c:376: warning: incompatible implicit declaration of built-in function ‘snprintf’
loadndisdriver.c:407: warning: incompatible implicit declaration of built-in function ‘strncpy’
loadndisdriver.c:367: warning: unused variable ‘statbuf’
loadndisdriver.c: In function ‘load_device’:
loadndisdriver.c:419: error: ‘DIR’ undeclared (first use in this function)
loadndisdriver.c:419: error: ‘dir’ undeclared (first use in this function)
loadndisdriver.c:423: error: ‘LOG_KERN’ undeclared (first use in this function)
loadndisdriver.c:423: error: ‘LOG_INFO’ undeclared (first use in this function)
loadndisdriver.c:424: warning: incompatible implicit declaration of built-in function ‘memset’
loadndisdriver.c:426: error: ‘errno’ undeclared (first use in this function)
loadndisdriver.c:427: error: ‘EINVAL’ undeclared (first use in this function)
loadndisdriver.c:429: error: ‘NULL’ undeclared (first use in this function)
loadndisdriver.c:434: warning: assignment makes pointer from integer without a cast
loadndisdriver.c:435: error: dereferencing pointer to incomplete type
loadndisdriver.c:436: error: dereferencing pointer to incomplete type
loadndisdriver.c:439: error: dereferencing pointer to incomplete type
loadndisdriver.c:447: error: expected expression before ‘struct’
loadndisdriver.c: In function ‘get_ioctl_device’:
loadndisdriver.c:464: error: ‘FILE’ undeclared (first use in this function)
loadndisdriver.c:464: error: ‘proc_misc’ undeclared (first use in this function)
loadndisdriver.c:472: warning: implicit declaration of function ‘strstr’
loadndisdriver.c:472: warning: incompatible implicit declaration of built-in function ‘strstr’
loadndisdriver.c:473: warning: implicit declaration of function ‘strtol’
loadndisdriver.c:473: error: ‘NULL’ undeclared (first use in this function)
loadndisdriver.c:483: error: ‘LOG_KERN’ undeclared (first use in this function)
loadndisdriver.c:483: error: ‘LOG_INFO’ undeclared (first use in this function)
loadndisdriver.c:488: warning: implicit declaration of function ‘unlink’
loadndisdriver.c:489: warning: implicit declaration of function ‘mknod’
loadndisdriver.c:489: error: ‘S_IFCHR’ undeclared (first use in this function)
loadndisdriver.c:489: error: ‘MISC_MAJOR’ undeclared (first use in this function)
loadndisdriver.c:490: error: ‘errno’ undeclared (first use in this function)
loadndisdriver.c:495: error: ‘O_RDONLY’ undeclared (first use in this function)
loadndisdriver.c: In function ‘main’:
loadndisdriver.c:511: warning: implicit declaration of function ‘openlog’
loadndisdriver.c:511: error: ‘LOG_PERROR’ undeclared (first use in this function)
loadndisdriver.c:511: error: ‘LOG_CONS’ undeclared (first use in this function)
loadndisdriver.c:511: error: ‘LOG_KERN’ undeclared (first use in this function)
loadndisdriver.c:511: error: ‘LOG_DEBUG’ undeclared (first use in this function)
loadndisdriver.c:513: error: ‘LOG_INFO’ undeclared (first use in this function)
loadndisdriver.c:515: warning: implicit declaration of function ‘strncmp’
loadndisdriver.c:517: warning: implicit declaration of function ‘printf’
loadndisdriver.c:517: warning: incompatible implicit declaration of built-in function ‘printf’
loadndisdriver.c:527: warning: implicit declaration of function ‘atoi’
loadndisdriver.c:542: warning: implicit declaration of function ‘atof’
loadndisdriver.c:549: warning: implicit declaration of function ‘strcmp’
loadndisdriver.c:556: warning: incompatible implicit declaration of built-in function ‘sscanf’
loadndisdriver.c:590: warning: implicit declaration of function ‘closelog’
make[1]: *** [loadndisdriver] Error 1
make[1]: Leaving directory `/home/laurens/ndiswrapper-1.52/utils'
make: *** [all] Error 2
laurens@laurens-ubuntu:~/ndiswrapper-1.52$ make > make.txt
loadndisdriver.c:15:20: error: stdlib.h: No such file or directory
loadndisdriver.c:16:19: error: stdio.h: No such file or directory
loadndisdriver.c:17:19: error: errno.h: No such file or directory
loadndisdriver.c:18:20: error: string.h: No such file or directory
loadndisdriver.c:19:20: error: libgen.h: No such file or directory
loadndisdriver.c:21:22: error: sys/mman.h: No such file or directory
loadndisdriver.c:23:23: error: sys/types.h: No such file or directory
loadndisdriver.c:24:23: error: sys/ioctl.h: No such file or directory
loadndisdriver.c:25:22: error: sys/stat.h: No such file or directory
loadndisdriver.c:26:20: error: unistd.h: No such file or directory
loadndisdriver.c:27:19: error: fcntl.h: No such file or directory
In file included from /usr/lib/gcc/i486-linux-gnu/4.2.3/include/syslimits.h:7,
                 from /usr/lib/gcc/i486-linux-gnu/4.2.3/include/limits.h:11,
                 from loadndisdriver.c:28:
/usr/lib/gcc/i486-linux-gnu/4.2.3/include/limits.h:122:61: error: limits.h: No such file or directory
loadndisdriver.c:29:19: error: ctype.h: No such file or directory
loadndisdriver.c:30:20: error: dirent.h: No such file or directory
loadndisdriver.c:31:20: error: syslog.h: No such file or directory
loadndisdriver.c:34:25: error: linux/major.h: No such file or directory
loadndisdriver.c:35:25: error: linux/ioctl.h: No such file or directory
In file included from loadndisdriver.c:37:
../driver/loader.h:24: error: expected specifier-qualifier-list before ‘size_t’
loadndisdriver.c: In function ‘load_file’:
loadndisdriver.c:67: error: ‘size_t’ undeclared (first use in this function)
loadndisdriver.c:67: error: (Each undeclared identifier is reported only once
loadndisdriver.c:67: error: for each function it appears in.)
loadndisdriver.c:67: error: expected ‘;’ before ‘size’
loadndisdriver.c:68: error: ‘NULL’ undeclared (first use in this function)
loadndisdriver.c:69: error: storage size of ‘statbuf’ isn’t known
loadndisdriver.c:71: warning: implicit declaration of function ‘basename’
loadndisdriver.c:71: warning: initialization makes pointer from integer without a cast
loadndisdriver.c:73: warning: implicit declaration of function ‘open’
loadndisdriver.c:73: error: ‘O_RDONLY’ undeclared (first use in this function)
loadndisdriver.c:75: warning: implicit declaration of function ‘syslog’
loadndisdriver.c:75: error: ‘LOG_KERN’ undeclared (first use in this function)
loadndisdriver.c:75: error: ‘LOG_INFO’ undeclared (first use in this function)
loadndisdriver.c:75: warning: implicit declaration of function ‘strerror’
loadndisdriver.c:75: error: ‘errno’ undeclared (first use in this function)
loadndisdriver.c:76: error: ‘EINVAL’ undeclared (first use in this function)
loadndisdriver.c:79: warning: implicit declaration of function ‘fstat’
loadndisdriver.c:81: warning: implicit declaration of function ‘close’
loadndisdriver.c:84: error: ‘size’ undeclared (first use in this function)
loadndisdriver.c:86: warning: implicit declaration of function ‘mmap’
loadndisdriver.c:86: error: ‘PROT_READ’ undeclared (first use in this function)
loadndisdriver.c:86: error: ‘MAP_PRIVATE’ undeclared (first use in this function)
loadndisdriver.c:86: warning: assignment makes pointer from integer without a cast
loadndisdriver.c:87: error: ‘MAP_FAILED’ undeclared (first use in this function)
loadndisdriver.c:93: warning: implicit declaration of function ‘strncpy’
loadndisdriver.c:93: warning: incompatible implicit declaration of built-in function ‘strncpy’
loadndisdriver.c:95: error: ‘struct load_driver_file’ has no member named ‘size’
loadndisdriver.c:96: error: ‘struct load_driver_file’ has no member named ‘data’
loadndisdriver.c:69: warning: unused variable ‘statbuf’
loadndisdriver.c: In function ‘parse_setting_line’:
loadndisdriver.c:109: warning: implicit declaration of function ‘isspace’
loadndisdriver.c:115: warning: implicit declaration of function ‘strchr’
loadndisdriver.c:115: warning: incompatible implicit declaration of built-in function ‘strchr’
loadndisdriver.c:115: error: ‘NULL’ undeclared (first use in this function)
loadndisdriver.c:117: error: ‘LOG_KERN’ undeclared (first use in this function)
loadndisdriver.c:117: error: ‘LOG_INFO’ undeclared (first use in this function)
loadndisdriver.c:118: error: ‘EINVAL’ undeclared (first use in this function)
loadndisdriver.c:138: warning: implicit declaration of function ‘strlen’
loadndisdriver.c:138: warning: incompatible implicit declaration of built-in function ‘strlen’
loadndisdriver.c: In function ‘read_conf_file’:
loadndisdriver.c:150: error: storage size of ‘statbuf’ isn’t known
loadndisdriver.c:151: error: ‘FILE’ undeclared (first use in this function)
loadndisdriver.c:151: error: ‘config’ undeclared (first use in this function)
loadndisdriver.c:157: warning: implicit declaration of function ‘lstat’
loadndisdriver.c:158: error: ‘LOG_KERN’ undeclared (first use in this function)
loadndisdriver.c:158: error: ‘LOG_INFO’ undeclared (first use in this function)
loadndisdriver.c:158: error: ‘errno’ undeclared (first use in this function)
loadndisdriver.c:160: error: ‘EINVAL’ undeclared (first use in this function)
loadndisdriver.c:163: warning: implicit declaration of function ‘sscanf’
loadndisdriver.c:163: warning: incompatible implicit declaration of built-in function ‘sscanf’
loadndisdriver.c:178: warning: implicit declaration of function ‘fopen’
loadndisdriver.c:178: error: ‘NULL’ undeclared (first use in this function)
loadndisdriver.c:182: warning: implicit declaration of function ‘fgets’
loadndisdriver.c:194: warning: incompatible implicit declaration of built-in function ‘strncpy’
loadndisdriver.c:205: warning: implicit declaration of function ‘fclose’
loadndisdriver.c:150: warning: unused variable ‘statbuf’
loadndisdriver.c: In function ‘load_bin_file’:
loadndisdriver.c:217: error: ‘LOG_KERN’ undeclared (first use in this function)
loadndisdriver.c:217: error: ‘LOG_INFO’ undeclared (first use in this function)
loadndisdriver.c:219: warning: implicit declaration of function ‘tolower’
loadndisdriver.c:221: warning: implicit declaration of function ‘chdir’
loadndisdriver.c:222: error: ‘errno’ undeclared (first use in this function)
loadndisdriver.c:224: error: ‘EINVAL’ undeclared (first use in this function)
loadndisdriver.c:230: warning: incompatible implicit declaration of built-in function ‘strncpy’
loadndisdriver.c:232: warning: implicit declaration of function ‘ioctl’
loadndisdriver.c:232: warning: implicit declaration of function ‘_IOW’
loadndisdriver.c:232: error: expected expression before ‘struct’
loadndisdriver.c: In function ‘load_driver’:
loadndisdriver.c:249: error: ‘DIR’ undeclared (first use in this function)
loadndisdriver.c:249: error: ‘driver_dir’ undeclared (first use in this function)
loadndisdriver.c:251: error: ‘NULL’ undeclared (first use in this function)
loadndisdriver.c:255: error: ‘LOG_KERN’ undeclared (first use in this function)
loadndisdriver.c:255: error: ‘LOG_INFO’ undeclared (first use in this function)
loadndisdriver.c:257: error: ‘errno’ undeclared (first use in this function)
loadndisdriver.c:259: error: ‘EINVAL’ undeclared (first use in this function)
loadndisdriver.c:261: warning: implicit declaration of function ‘opendir’
loadndisdriver.c:267: warning: implicit declaration of function ‘malloc’
loadndisdriver.c:267: warning: incompatible implicit declaration of built-in function ‘malloc’
loadndisdriver.c:271: warning: implicit declaration of function ‘memset’
loadndisdriver.c:271: warning: incompatible implicit declaration of built-in function ‘memset’
loadndisdriver.c:272: warning: incompatible implicit declaration of built-in function ‘strncpy’
loadndisdriver.c:280: warning: implicit declaration of function ‘readdir’
loadndisdriver.c:280: warning: assignment makes pointer from integer without a cast
loadndisdriver.c:282: error: storage size of ‘statbuf’ isn’t known
loadndisdriver.c:284: error: dereferencing pointer to incomplete type
loadndisdriver.c:287: warning: implicit declaration of function ‘stat’
loadndisdriver.c:287: error: dereferencing pointer to incomplete type
loadndisdriver.c:288: warning: implicit declaration of function ‘S_ISREG’
loadndisdriver.c:289: error: dereferencing pointer to incomplete type
loadndisdriver.c:294: warning: incompatible implicit declaration of built-in function ‘strlen’
loadndisdriver.c:294: error: dereferencing pointer to incomplete type
loadndisdriver.c:296: warning: implicit declaration of function ‘strcasecmp’
loadndisdriver.c:296: error: dereferencing pointer to incomplete type
loadndisdriver.c:299: error: dereferencing pointer to incomplete type
loadndisdriver.c:302: error: dereferencing pointer to incomplete type
loadndisdriver.c:303: error: dereferencing pointer to incomplete type
loadndisdriver.c:305: error: dereferencing pointer to incomplete type
loadndisdriver.c:311: error: dereferencing pointer to incomplete type
loadndisdriver.c:312: error: dereferencing pointer to incomplete type
loadndisdriver.c:313: warning: implicit declaration of function ‘strcpy’
loadndisdriver.c:313: warning: incompatible implicit declaration of built-in function ‘strcpy’
loadndisdriver.c:314: error: dereferencing pointer to incomplete type
loadndisdriver.c:317: error: ‘struct load_driver_file’ has no member named ‘size’
loadndisdriver.c:318: error: ‘struct load_driver_file’ has no member named ‘data’
loadndisdriver.c:321: error: dereferencing pointer to incomplete type
loadndisdriver.c:282: warning: unused variable ‘statbuf’
loadndisdriver.c:344: error: expected expression before ‘struct’
loadndisdriver.c:346: warning: implicit declaration of function ‘closedir’
loadndisdriver.c:348: warning: implicit declaration of function ‘free’
loadndisdriver.c:355: warning: implicit declaration of function ‘munmap’
loadndisdriver.c:355: error: ‘struct load_driver_file’ has no member named ‘data’
loadndisdriver.c:355: error: ‘struct load_driver_file’ has no member named ‘size’
loadndisdriver.c:357: error: ‘struct load_driver_file’ has no member named ‘data’
loadndisdriver.c:357: error: ‘struct load_driver_file’ has no member named ‘size’
loadndisdriver.c: In function ‘get_device’:
loadndisdriver.c:367: error: storage size of ‘statbuf’ isn’t known
loadndisdriver.c:370: error: ‘LOG_KERN’ undeclared (first use in this function)
loadndisdriver.c:370: error: ‘LOG_INFO’ undeclared (first use in this function)
loadndisdriver.c:373: error: ‘errno’ undeclared (first use in this function)
loadndisdriver.c:374: error: ‘EINVAL’ undeclared (first use in this function)
loadndisdriver.c:376: warning: implicit declaration of function ‘snprintf’
loadndisdriver.c:376: warning: incompatible implicit declaration of built-in function ‘snprintf’
loadndisdriver.c:407: warning: incompatible implicit declaration of built-in function ‘strncpy’
loadndisdriver.c:367: warning: unused variable ‘statbuf’
loadndisdriver.c: In function ‘load_device’:
loadndisdriver.c:419: error: ‘DIR’ undeclared (first use in this function)
loadndisdriver.c:419: error: ‘dir’ undeclared (first use in this function)
loadndisdriver.c:423: error: ‘LOG_KERN’ undeclared (first use in this function)
loadndisdriver.c:423: error: ‘LOG_INFO’ undeclared (first use in this function)
loadndisdriver.c:424: warning: incompatible implicit declaration of built-in function ‘memset’
loadndisdriver.c:426: error: ‘errno’ undeclared (first use in this function)
loadndisdriver.c:427: error: ‘EINVAL’ undeclared (first use in this function)
loadndisdriver.c:429: error: ‘NULL’ undeclared (first use in this function)
loadndisdriver.c:434: warning: assignment makes pointer from integer without a cast
loadndisdriver.c:435: error: dereferencing pointer to incomplete type
loadndisdriver.c:436: error: dereferencing pointer to incomplete type
loadndisdriver.c:439: error: dereferencing pointer to incomplete type
loadndisdriver.c:447: error: expected expression before ‘struct’
loadndisdriver.c: In function ‘get_ioctl_device’:
loadndisdriver.c:464: error: ‘FILE’ undeclared (first use in this function)
loadndisdriver.c:464: error: ‘proc_misc’ undeclared (first use in this function)
loadndisdriver.c:472: warning: implicit declaration of function ‘strstr’
loadndisdriver.c:472: warning: incompatible implicit declaration of built-in function ‘strstr’
loadndisdriver.c:473: warning: implicit declaration of function ‘strtol’
loadndisdriver.c:473: error: ‘NULL’ undeclared (first use in this function)
loadndisdriver.c:483: error: ‘LOG_KERN’ undeclared (first use in this function)
loadndisdriver.c:483: error: ‘LOG_INFO’ undeclared (first use in this function)
loadndisdriver.c:488: warning: implicit declaration of function ‘unlink’
loadndisdriver.c:489: warning: implicit declaration of function ‘mknod’
loadndisdriver.c:489: error: ‘S_IFCHR’ undeclared (first use in this function)
loadndisdriver.c:489: error: ‘MISC_MAJOR’ undeclared (first use in this function)
loadndisdriver.c:490: error: ‘errno’ undeclared (first use in this function)
loadndisdriver.c:495: error: ‘O_RDONLY’ undeclared (first use in this function)
loadndisdriver.c: In function ‘main’:
loadndisdriver.c:511: warning: implicit declaration of function ‘openlog’
loadndisdriver.c:511: error: ‘LOG_PERROR’ undeclared (first use in this function)
loadndisdriver.c:511: error: ‘LOG_CONS’ undeclared (first use in this function)
loadndisdriver.c:511: error: ‘LOG_KERN’ undeclared (first use in this function)
loadndisdriver.c:511: error: ‘LOG_DEBUG’ undeclared (first use in this function)
loadndisdriver.c:513: error: ‘LOG_INFO’ undeclared (first use in this function)
loadndisdriver.c:515: warning: implicit declaration of function ‘strncmp’
loadndisdriver.c:517: warning: implicit declaration of function ‘printf’
loadndisdriver.c:517: warning: incompatible implicit declaration of built-in function ‘printf’
loadndisdriver.c:527: warning: implicit declaration of function ‘atoi’
loadndisdriver.c:542: warning: implicit declaration of function ‘atof’
loadndisdriver.c:549: warning: implicit declaration of function ‘strcmp’
loadndisdriver.c:556: warning: incompatible implicit declaration of built-in function ‘sscanf’
loadndisdriver.c:590: warning: implicit declaration of function ‘closelog’
make[1]: *** [loadndisdriver] Error 1
make: *** [all] Error 2
moderator edit: gelieve lange outputs en code tags te zetten

Offline petervs

  • Lid
  • Steunpunt: Nee
Ubuntu 7.10 wireless Atheros netwerkkaart
« Reactie #8 Gepost op: 2008/05/19, 13:17:55 »
Zelf heb ik nog ubuntu 7.10 en geen ervaring met ndiswrapper of ndisgtk (grafische variant).
Volgens mij is in 8.04 ndiswrapper al geinstalleerd.

de handleiding hiervan is hier:
https://wiki.ubuntu.com/NlWifi/ndiswrapper      (vanaf 2.3.1)

Je windows driver vindt je hier:
http://www.atheros.cz/      (AR5006X / AR5413)

Met de zoekfunctie kun je nog betere handleidingen vinden.
Ubuntu MATE 16.04

Laurensz

  • Gast
Ubuntu 7.10 wireless Atheros netwerkkaart
« Reactie #9 Gepost op: 2008/05/19, 17:57:20 »
Hallo, de link naar bijvoorbeeld "http://packages.ubuntu.com/dapper/misc/ndiswrapper-utils"  geeft een timeout, dus waar zou ik dan die packages vandaan moeten halen?

Bedankt!

Edit: op de atheros website word ik voor de linuxdriver doorverwezen naar madwifi, moet ik dat installeren?
Edit2: ik wilde in de madwifi directory het command "make" weer gebruiken, maar ook hier kreeg ik weer errors!
/home/laurens/madwifi-0.9.4/ath_hal/uudecode.c:26:19: error: stdio.h: No such file or directory
/home/laurens/madwifi-0.9.4/ath_hal/uudecode.c:27:19: error: errno.h: No such file or directory
/home/laurens/madwifi-0.9.4/ath_hal/uudecode.c:28:20: error: getopt.h: No such file or directory
/home/laurens/madwifi-0.9.4/ath_hal/uudecode.c:29:20: error: string.h: No such file or directory
/home/laurens/madwifi-0.9.4/ath_hal/uudecode.c:30:20: error: stdlib.h: No such file or directory
/home/laurens/madwifi-0.9.4/ath_hal/uudecode.c:32:23: error: sys/fcntl.h: No such file or directory
/home/laurens/madwifi-0.9.4/ath_hal/uudecode.c:33:22: error: sys/stat.h: No such file or directory
/home/laurens/madwifi-0.9.4/ath_hal/uudecode.c: In function 'uudecode_usage':
/home/laurens/madwifi-0.9.4/ath_hal/uudecode.c:37: warning: implicit declaration of function 'printf'
/home/laurens/madwifi-0.9.4/ath_hal/uudecode.c:37: warning: incompatible implicit declaration of built-in function 'printf'
/home/laurens/madwifi-0.9.4/ath_hal/uudecode.c: At top level:
/home/laurens/madwifi-0.9.4/ath_hal/uudecode.c:40: error: expected ')' before '*' token
/home/laurens/madwifi-0.9.4/ath_hal/uudecode.c:70: error: expected ')' before '*' token
/home/laurens/madwifi-0.9.4/ath_hal/uudecode.c: In function 'main':
/home/laurens/madwifi-0.9.4/ath_hal/uudecode.c:121: error: 'FILE' undeclared (first use in this function)
/home/laurens/madwifi-0.9.4/ath_hal/uudecode.c:121: error: (Each undeclared identifier is reported only once
/home/laurens/madwifi-0.9.4/ath_hal/uudecode.c:121: error: for each function it appears in.)
/home/laurens/madwifi-0.9.4/ath_hal/uudecode.c:121: error: 'src_stream' undeclared (first use in this function)
/home/laurens/madwifi-0.9.4/ath_hal/uudecode.c:122: error: 'dst_stream' undeclared (first use in this function)
/home/laurens/madwifi-0.9.4/ath_hal/uudecode.c:122: error: 'NULL' undeclared (first use in this function)
/home/laurens/madwifi-0.9.4/ath_hal/uudecode.c:130: warning: implicit declaration of function 'getopt'
/home/laurens/madwifi-0.9.4/ath_hal/uudecode.c:134: error: 'optarg' undeclared (first use in this function)
/home/laurens/madwifi-0.9.4/ath_hal/uudecode.c:138: warning: implicit declaration of function 'exit'
/home/laurens/madwifi-0.9.4/ath_hal/uudecode.c:138: warning: incompatible implicit declaration of built-in function 'exit'
/home/laurens/madwifi-0.9.4/ath_hal/uudecode.c:141: error: 'optind' undeclared (first use in this function)
/home/laurens/madwifi-0.9.4/ath_hal/uudecode.c:142: error: 'stdin' undeclared (first use in this function)
/home/laurens/madwifi-0.9.4/ath_hal/uudecode.c:144: warning: implicit declaration of function 'fopen'
/home/laurens/madwifi-0.9.4/ath_hal/uudecode.c:146: warning: implicit declaration of function 'fprintf'
/home/laurens/madwifi-0.9.4/ath_hal/uudecode.c:146: warning: incompatible implicit declaration of built-in function 'fprintf'
/home/laurens/madwifi-0.9.4/ath_hal/uudecode.c:146: error: 'stderr' undeclared (first use in this function)
/home/laurens/madwifi-0.9.4/ath_hal/uudecode.c:147: warning: implicit declaration of function 'strerror'
/home/laurens/madwifi-0.9.4/ath_hal/uudecode.c:147: error: 'errno' undeclared (first use in this function)
/home/laurens/madwifi-0.9.4/ath_hal/uudecode.c:147: warning: format '%s' expects type 'char *', but argument 4 has type 'int'
/home/laurens/madwifi-0.9.4/ath_hal/uudecode.c:148: warning: incompatible implicit declaration of built-in function 'exit'
/home/laurens/madwifi-0.9.4/ath_hal/uudecode.c:152: warning: incompatible implicit declaration of built-in function 'exit'
/home/laurens/madwifi-0.9.4/ath_hal/uudecode.c:156: warning: implicit declaration of function 'get_line_from_file'
/home/laurens/madwifi-0.9.4/ath_hal/uudecode.c:156: warning: assignment makes pointer from integer without a cast
/home/laurens/madwifi-0.9.4/ath_hal/uudecode.c:157: warning: implicit declaration of function 'strncmp'
/home/laurens/madwifi-0.9.4/ath_hal/uudecode.c:164: warning: incompatible implicit declaration of built-in function 'fprintf'
/home/laurens/madwifi-0.9.4/ath_hal/uudecode.c:165: warning: incompatible implicit declaration of built-in function 'exit'
/home/laurens/madwifi-0.9.4/ath_hal/uudecode.c:168: warning: implicit declaration of function 'strtoul'
/home/laurens/madwifi-0.9.4/ath_hal/uudecode.c:170: warning: implicit declaration of function 'strchr'
/home/laurens/madwifi-0.9.4/ath_hal/uudecode.c:170: warning: incompatible implicit declaration of built-in function 'strchr'
/home/laurens/madwifi-0.9.4/ath_hal/uudecode.c:172: warning: incompatible implicit declaration of built-in function 'fprintf'
/home/laurens/madwifi-0.9.4/ath_hal/uudecode.c:173: warning: incompatible implicit declaration of built-in function 'exit'
/home/laurens/madwifi-0.9.4/ath_hal/uudecode.c:178: warning: implicit declaration of function 'strcmp'
/home/laurens/madwifi-0.9.4/ath_hal/uudecode.c:179: error: 'stdout' undeclared (first use in this function)
/home/laurens/madwifi-0.9.4/ath_hal/uudecode.c:182: error: 'O_WRONLY' undeclared (first use in this function)
/home/laurens/madwifi-0.9.4/ath_hal/uudecode.c:182: error: 'O_CREAT' undeclared (first use in this function)
/home/laurens/madwifi-0.9.4/ath_hal/uudecode.c:182: error: 'O_TRUNC' undeclared (first use in this function)
/home/laurens/madwifi-0.9.4/ath_hal/uudecode.c:186: error: 'O_EXCL' undeclared (first use in this function)
/home/laurens/madwifi-0.9.4/ath_hal/uudecode.c:188: warning: implicit declaration of function 'open'
/home/laurens/madwifi-0.9.4/ath_hal/uudecode.c:189: error: 'S_IRWXU' undeclared (first use in this function)
/home/laurens/madwifi-0.9.4/ath_hal/uudecode.c:189: error: 'S_IRWXG' undeclared (first use in this function)
/home/laurens/madwifi-0.9.4/ath_hal/uudecode.c:189: error: 'S_IRWXO' undeclared (first use in this function)
/home/laurens/madwifi-0.9.4/ath_hal/uudecode.c:191: warning: implicit declaration of function 'fdopen'
/home/laurens/madwifi-0.9.4/ath_hal/uudecode.c:193: warning: incompatible implicit declaration of built-in function 'fprintf'
/home/laurens/madwifi-0.9.4/ath_hal/uudecode.c:194: warning: format '%s' expects type 'char *', but argument 4 has type 'int'
/home/laurens/madwifi-0.9.4/ath_hal/uudecode.c:195: warning: incompatible implicit declaration of built-in function 'exit'
/home/laurens/madwifi-0.9.4/ath_hal/uudecode.c:199: warning: implicit declaration of function 'read_stduu'
/home/laurens/madwifi-0.9.4/ath_hal/uudecode.c:201: warning: implicit declaration of function 'fclose'
make[3]: *** [/home/laurens/madwifi-0.9.4/ath_hal/uudecode] Error 1
make[2]: *** [/home/laurens/madwifi-0.9.4/ath_hal] Error 2
make[1]: *** [_module_/home/laurens/madwifi-0.9.4] Error 2
Bij elk make command krijg ik wel errors..

Offline petervs

  • Lid
  • Steunpunt: Nee
Ubuntu 7.10 wireless Atheros netwerkkaart
« Reactie #10 Gepost op: 2008/05/19, 18:14:43 »
Bij de link van de handleiding staat:
Zelfs als er voor je draadloze netwerkkaart geen Linux-driver voor handen is, kun je hem misschien toch nog aan de praat krijgen met ndiswrapper. Ndiswrapper is een Linux module die Ubuntu in staat stelt Windows drivers te gebruiken voor draadloze netwerkkaarten.

Je moet dus de windows driver hebben, bijv. van windows xp.
Ubuntu MATE 16.04

Laurensz

  • Gast
Ubuntu 7.10 wireless Atheros netwerkkaart
« Reactie #11 Gepost op: 2008/05/19, 18:19:47 »
Ja maar ook als ik ndiswrapper wil compilen, krijg ik errors.

Offline petervs

  • Lid
  • Steunpunt: Nee
Ubuntu 7.10 wireless Atheros netwerkkaart
« Reactie #12 Gepost op: 2008/05/19, 18:36:35 »
Citaat van: Laurensz
Ja maar ook als ik ndiswrapper wil compilen, krijg ik errors.
Probeer het eens met Ndisgtk, dat kun je binnenhalen met synaptic.
Ubuntu MATE 16.04

Laurensz

  • Gast
Ubuntu 7.10 wireless Atheros netwerkkaart
« Reactie #13 Gepost op: 2008/05/19, 18:39:59 »
Citaat van: Schiemanski
Citaat van: Laurensz
Ja maar ook als ik ndiswrapper wil compilen, krijg ik errors.
Probeer het eens met Ndisgtk, dat kun je binnenhalen met synaptic.
Ik heb geen internet, dus ik kan het dan ook niet binnenhalen, toch?

Edit: http://packages.ubuntu.com/hardy/ndisgtk

Even proberen..

Edit2: ik zie dat alles heerlijk werkt door .dev bestandjes te installeren, zo installeer ik al de componenten! ik reaguur wel even wanneer ndisgtk eindelijk is geinstalleerd..

Laurensz

  • Gast
Ubuntu 7.10 wireless Atheros netwerkkaart
« Reactie #14 Gepost op: 2008/05/19, 18:53:00 »
EINDELIJK! Ndisgtk is geinstalleerd! Ik ga nu even de stappen volgen...

Edit: in NDISgtk staat:

*netathwx*
Hardware present: Yes

Maar als ik de rechtermuisknop doe op het netwerkicoontje, en dan edit wireless networks... dan zie ik geen netwerken? moet ik misschien herstarten?

Offline petervs

  • Lid
  • Steunpunt: Nee
Ubuntu 7.10 wireless Atheros netwerkkaart
« Reactie #15 Gepost op: 2008/05/19, 19:12:01 »
Ja
Ubuntu MATE 16.04

Laurensz

  • Gast
Ubuntu 7.10 wireless Atheros netwerkkaart
« Reactie #16 Gepost op: 2008/05/19, 19:28:30 »
Ik heb het herstart, maar nog steeds hetzelfde ongewenste resultaat?

Alles installeerde goed, en de device was ook herkend.
Toen ik "sudo depmod -a" deed, kwam er ook geen error.
Maar toen ik "sudo iwconfig wlan0" deed, stond er "wlan0: no device".

Ook als ik de system log bekijk staat er niet "ndiswrapper version ****, driver "blabla" loaded"..

aure

  • Gast
Ubuntu 7.10 wireless Atheros netwerkkaart
« Reactie #17 Gepost op: 2008/05/19, 20:54:55 »
Citaat van: pjotr123
Heb je deze handleiding al geprobeerd:
http://computertip.googlepages.com/atherosdraadlozekaart
complimenten, wat een goeie handleiding!

deze handleiding werkt ook voor 8.04

in 1 keer alles werkend gekregen. ik heb ook een Atheros (AR5007EG) Wlan kaart

voor mensen die nog problemen hebben na deze handleiding , stel in bij netwerken "activeer zwevende modus".
dit stond bij niet standaard ingesteld.

wat houd precies  "build-essential" in? ik heb het geïnstalleerd maar wat het doet en wat ik precies geïnstalleerd heb?

Laurensz

  • Gast
Ubuntu 7.10 wireless Atheros netwerkkaart
« Reactie #18 Gepost op: 2008/05/19, 20:59:06 »
Citaat van: aure
Citaat van: pjotr123
Heb je deze handleiding al geprobeerd:
http://computertip.googlepages.com/atherosdraadlozekaart
complimenten, wat een goeie handleiding!

deze handleiding werkt ook voor 8.04

in 1 keer alles werkend gekregen. ik heb ook een Atheros (AR5007EG) Wlan kaart

voor mensen die nog problemen hebben na deze handleiding , stel in bij netwerken "activeer zwevende modus".
dit stond bij niet standaard ingesteld.

wat houd precies  "build-essential" in? ik heb het geïnstalleerd maar wat het doet en wat ik precies geïnstalleerd heb?
Die probeer ik dus ook te volgen, maar bij mij krijg ik allemaal errors bij "make" en "make install"!

Offline petervs

  • Lid
  • Steunpunt: Nee
Ubuntu 7.10 wireless Atheros netwerkkaart
« Reactie #19 Gepost op: 2008/05/19, 21:15:41 »
Laurensz,

Dat werkt bij een AR5007EG kaart, en die heb jij niet helaas.
Ubuntu MATE 16.04

Laurensz

  • Gast
Ubuntu 7.10 wireless Atheros netwerkkaart
« Reactie #20 Gepost op: 2008/05/19, 21:18:46 »
Citaat van: Schiemanski
Laurensz,

Dat werkt bij een AR5007EG kaart, en die heb jij niet helaas.
Oke, kan jij me helpen met het probleem waar ik nu mee kamp?

aure

  • Gast
Ubuntu 7.10 wireless Atheros netwerkkaart
« Reactie #21 Gepost op: 2008/05/19, 21:23:34 »
@Laurensz,


welke type Atheros netwerkkaart heb je?
(kijk anders even onder apparaat beheer in Windows)

eerst "build-essential"installaren, herstarten

dan je driver donloaden en installeren.

let op dat je nieuwste download: bij mij was dat dus "madwifi-nr-r3366+ar5007.tar.gz"


let op bij punt 3 van de handleiding, als je home is: "cees bij mij aure" dan moet de driver ook daar staan en niet in een sub mapje.
(Locaties>persoonlijke map)

voorbeeld: /home/aure/madwifi-nr-r3366+ar5007.tar.gz

in de bestandsbladeraar, uitpakken (menu rechtermuis)

bij punt 5 : cd [spatie] madwifi-nr-r3366+ar5007
(let op de -en+)

punt 5, 6 en7, duurde het bij mij even.

aure

  • Gast
Ubuntu 7.10 wireless Atheros netwerkkaart
« Reactie #22 Gepost op: 2008/05/19, 21:24:53 »
Citaat van: Schiemanski
Laurensz,

Dat werkt bij een AR5007EG kaart, en die heb jij niet helaas.
welke kaart heb je dan prescies?

Laurensz

  • Gast
Ubuntu 7.10 wireless Atheros netwerkkaart
« Reactie #23 Gepost op: 2008/05/19, 21:30:22 »
Citaat van: aure
Citaat van: Schiemanski
Laurensz,

Dat werkt bij een AR5007EG kaart, en die heb jij niet helaas.
welke kaart heb je dan prescies?
Dat weet ik niet, in het apparaatbeheer laat hij gewoon van HP zien, maar dat komt omdat ik een HP OEM heb, en HP een kaart gebruikt met de chipset Atheros.

aure

  • Gast
Ubuntu 7.10 wireless Atheros netwerkkaart
« Reactie #24 Gepost op: 2008/05/19, 21:36:26 »
welk type/model nummer van HP heb?
wat staat er bij de eigenschappen van die netwerkkaart in apparaatbeheer in windows?